CO..Pt3(CO)4 radical anion
- Formula: C5O5Pt3-
- Molecular weight: 725.303

Gas phase thermochemistry data

Data compiled by: John E. Bartmess
Quantity | Value | Units | Method | Reference | Comment |
---|---|---|---|---|---|
ΔfH°gas | -640. ± 75. | kJ/mol | Ther | Grushow and Ervin, 1997 |

Ion clustering data

Data compiled by: John E. Bartmess
Clustering reactions
C4O4Pt3- + = C5O5Pt3-
By formula: C4O4Pt3- + CO = C5O5Pt3-
Quantity | Value | Units | Method | Reference | Comment |
---|---|---|---|---|---|
ΔrH° | 109. ± 18. | kJ/mol | N/A | Grushow and Ervin, 1997 | gas phase |
C5O5Pt3- + = C6O6Pt3-
By formula: C5O5Pt3- + CO = C6O6Pt3-
Quantity | Value | Units | Method | Reference | Comment |
---|---|---|---|---|---|
ΔrH° | 174. ± 29. | kJ/mol | N/A | Grushow and Ervin, 1997 | gas phase |
ΔrH° | 166. ± 14. | kJ/mol | PDis | Shi, Spasov, et al., 2001 | gas phase |

Reaction thermochemistry data

Data compiled by: John E. Bartmess
Individual Reactions
C5O5Pt3- + = C6O6Pt3-
By formula: C5O5Pt3- + CO = C6O6Pt3-
Quantity | Value | Units | Method | Reference | Comment |
---|---|---|---|---|---|
ΔrH° | 41.5 ± 6.9 | kcal/mol | N/A | Grushow and Ervin, 1997 | gas phase |
ΔrH° | 39.7 ± 3.3 | kcal/mol | PDis | Shi, Spasov, et al., 2001 | gas phase |
C4O4Pt3- + = C5O5Pt3-
By formula: C4O4Pt3- + CO = C5O5Pt3-
Quantity | Value | Units | Method | Reference | Comment |
---|---|---|---|---|---|
ΔrH° | 26.1 ± 4.4 | kcal/mol | N/A | Grushow and Ervin, 1997 | gas phase |

References

Grushow and Ervin, 1997
Grushow, A.; Ervin, K.M.,
Ligand and Metal Binding Energies in Platinum Carbonyl Cluster Anions: Collision Induced Dissociation of PtM- and Ptm(CO)n-,
J. Chem. Phys., 1997, 106, 23, 9580, https://doi.org/10.1063/1.474116
. [all data]
Shi, Spasov, et al., 2001
Shi, Y.; Spasov, V.A.; Ervin, K.M.,
Photodesorption of carbonyl from Pt-3(CO)(n)(-) (n=1-6),
Int. J. Mass Spectrom., 2001, 204, 1-3, 197-208, https://doi.org/10.1016/S1387-3806(00)00364-X
. [all data]