CO..Pt3(CO)3 radical anion
- Formula: C4O4Pt3-
- Molecular weight: 697.293

Reaction thermochemistry data

Data compiled by: John E. Bartmess
Individual Reactions
C3O3Pt3- + = C4O4Pt3-
By formula: C3O3Pt3- + CO = C4O4Pt3-
Quantity | Value | Units | Method | Reference | Comment |
---|---|---|---|---|---|
ΔrH° | 102. ± 13. | kJ/mol | N/A | Grushow and Ervin, 1997 | gas phase |
C4O4Pt3- + = C5O5Pt3-
By formula: C4O4Pt3- + CO = C5O5Pt3-
Quantity | Value | Units | Method | Reference | Comment |
---|---|---|---|---|---|
ΔrH° | 109. ± 18. | kJ/mol | N/A | Grushow and Ervin, 1997 | gas phase |

Ion clustering data

Data compiled by: John E. Bartmess
Clustering reactions
C3O3Pt3- + = C4O4Pt3-
By formula: C3O3Pt3- + CO = C4O4Pt3-
Quantity | Value | Units | Method | Reference | Comment |
---|---|---|---|---|---|
ΔrH° | 102. ± 13. | kJ/mol | N/A | Grushow and Ervin, 1997 | gas phase |
C4O4Pt3- + = C5O5Pt3-
By formula: C4O4Pt3- + CO = C5O5Pt3-
Quantity | Value | Units | Method | Reference | Comment |
---|---|---|---|---|---|
ΔrH° | 109. ± 18. | kJ/mol | N/A | Grushow and Ervin, 1997 | gas phase |

References

Grushow and Ervin, 1997
Grushow, A.; Ervin, K.M.,
Ligand and Metal Binding Energies in Platinum Carbonyl Cluster Anions: Collision Induced Dissociation of PtM- and Ptm(CO)n-,
J. Chem. Phys., 1997, 106, 23, 9580, https://doi.org/10.1063/1.474116
. [all data]