CO..Pt3(CO)2 radical anion
- Formula: C3O3Pt3-
- Molecular weight: 669.283

Gas phase thermochemistry data

Data compiled by: John E. Bartmess
Quantity | Value | Units | Method | Reference | Comment |
---|---|---|---|---|---|
ΔfH°gas | -210. ± 71. | kJ/mol | Ther | Grushow and Ervin, 1997 |

Ion clustering data

Data compiled by: John E. Bartmess
Clustering reactions
C2O2Pt3- + = C3O3Pt3-
By formula: C2O2Pt3- + CO = C3O3Pt3-
Quantity | Value | Units | Method | Reference | Comment |
---|---|---|---|---|---|
ΔrH° | 220. ± 22. | kJ/mol | N/A | Grushow and Ervin, 1997 | gas phase |
ΔrH° | 206. ± 14. | kJ/mol | PDis | Shi, Spasov, et al., 2001 | gas phase |
C3O3Pt3- + = C4O4Pt3-
By formula: C3O3Pt3- + CO = C4O4Pt3-
Quantity | Value | Units | Method | Reference | Comment |
---|---|---|---|---|---|
ΔrH° | 102. ± 13. | kJ/mol | N/A | Grushow and Ervin, 1997 | gas phase |

References

Grushow and Ervin, 1997
Grushow, A.; Ervin, K.M.,
Ligand and Metal Binding Energies in Platinum Carbonyl Cluster Anions: Collision Induced Dissociation of PtM- and Ptm(CO)n-,
J. Chem. Phys., 1997, 106, 23, 9580, https://doi.org/10.1063/1.474116
. [all data]
Shi, Spasov, et al., 2001
Shi, Y.; Spasov, V.A.; Ervin, K.M.,
Photodesorption of carbonyl from Pt-3(CO)(n)(-) (n=1-6),
Int. J. Mass Spectrom., 2001, 204, 1-3, 197-208, https://doi.org/10.1016/S1387-3806(00)00364-X
. [all data]