CO..Pt3CO radical anion
- Formula: C2O2Pt3-
- Molecular weight: 641.273

Reaction thermochemistry data

Data compiled by: John E. Bartmess
Individual Reactions
C2O2Pt3- + = C3O3Pt3-
By formula: C2O2Pt3- + CO = C3O3Pt3-
Quantity | Value | Units | Method | Reference | Comment |
---|---|---|---|---|---|
ΔrH° | 52.6 ± 5.3 | kcal/mol | N/A | Grushow and Ervin, 1997 | gas phase |
ΔrH° | 49.2 ± 3.3 | kcal/mol | PDis | Shi, Spasov, et al., 2001 | gas phase |
COPt3- + = C2O2Pt3-
By formula: COPt3- + CO = C2O2Pt3-
Quantity | Value | Units | Method | Reference | Comment |
---|---|---|---|---|---|
ΔrH° | 53. ± 12. | kcal/mol | N/A | Grushow and Ervin, 1997 | gas phase |

Ion clustering data

Data compiled by: John E. Bartmess
Clustering reactions
COPt3- + = C2O2Pt3-
By formula: COPt3- + CO = C2O2Pt3-
Quantity | Value | Units | Method | Reference | Comment |
---|---|---|---|---|---|
ΔrH° | 53. ± 12. | kcal/mol | N/A | Grushow and Ervin, 1997 | gas phase |
C2O2Pt3- + = C3O3Pt3-
By formula: C2O2Pt3- + CO = C3O3Pt3-
Quantity | Value | Units | Method | Reference | Comment |
---|---|---|---|---|---|
ΔrH° | 52.6 ± 5.3 | kcal/mol | N/A | Grushow and Ervin, 1997 | gas phase |
ΔrH° | 49.2 ± 3.3 | kcal/mol | PDis | Shi, Spasov, et al., 2001 | gas phase |

References

Grushow and Ervin, 1997
Grushow, A.; Ervin, K.M.,
Ligand and Metal Binding Energies in Platinum Carbonyl Cluster Anions: Collision Induced Dissociation of PtM- and Ptm(CO)n-,
J. Chem. Phys., 1997, 106, 23, 9580, https://doi.org/10.1063/1.474116
. [all data]
Shi, Spasov, et al., 2001
Shi, Y.; Spasov, V.A.; Ervin, K.M.,
Photodesorption of carbonyl from Pt-3(CO)(n)(-) (n=1-6),
Int. J. Mass Spectrom., 2001, 204, 1-3, 197-208, https://doi.org/10.1016/S1387-3806(00)00364-X
. [all data]