CO..Pt3 radical anion
- Formula: COPt3-
- Molecular weight: 613.263

Reaction thermochemistry data

Data compiled by: John E. Bartmess
Individual Reactions
Pt3- + = COPt3-
By formula: Pt3- + CO = COPt3-
Quantity | Value | Units | Method | Reference | Comment |
---|---|---|---|---|---|
ΔrH° | 222. ± 29. | kJ/mol | N/A | Grushow and Ervin, 1997 | gas phase |
COPt3- + = C2O2Pt3-
By formula: COPt3- + CO = C2O2Pt3-
Quantity | Value | Units | Method | Reference | Comment |
---|---|---|---|---|---|
ΔrH° | 220. ± 50. | kJ/mol | N/A | Grushow and Ervin, 1997 | gas phase |

Ion clustering data

Data compiled by: John E. Bartmess
Clustering reactions
COPt3- + = C2O2Pt3-
By formula: COPt3- + CO = C2O2Pt3-
Quantity | Value | Units | Method | Reference | Comment |
---|---|---|---|---|---|
ΔrH° | 220. ± 50. | kJ/mol | N/A | Grushow and Ervin, 1997 | gas phase |
Pt3- + = COPt3-
By formula: Pt3- + CO = COPt3-
Quantity | Value | Units | Method | Reference | Comment |
---|---|---|---|---|---|
ΔrH° | 222. ± 29. | kJ/mol | N/A | Grushow and Ervin, 1997 | gas phase |

Gas phase thermochemistry data

Data compiled by: John E. Bartmess
Quantity | Value | Units | Method | Reference | Comment |
---|---|---|---|---|---|
ΔfH°gas | 109. ± 12. | kcal/mol | Ther | Grushow and Ervin, 1997 |

References

Grushow and Ervin, 1997
Grushow, A.; Ervin, K.M.,
Ligand and Metal Binding Energies in Platinum Carbonyl Cluster Anions: Collision Induced Dissociation of PtM- and Ptm(CO)n-,
J. Chem. Phys., 1997, 106, 23, 9580, https://doi.org/10.1063/1.474116
. [all data]