HCNC radical anion
- Formula: C2HN-
- Molecular weight: 39.0366

Gas phase thermochemistry data

Data compiled by: John E. Bartmess
Quantity | Value | Units | Method | Reference | Comment |
---|---|---|---|---|---|
ΔfH°gas | 394. ± 17. | kJ/mol | Acid | Matimba, Crabbendam, et al., 1992 |

References

Matimba, Crabbendam, et al., 1992
Matimba, H.E.K.; Crabbendam, A.M.; Ingemann, S.; Nibbering, N.M.M.,
Gas-phase Bimolecular Chemistry of the .-CHNC and .-CHCN Radical Anions,
Int. J. Mass Spectrom. Ion Proc., 1992, 114, 1-2, 85, https://doi.org/10.1016/0168-1176(92)85024-T
. [all data]