Benzene, 1,3-dimethyl-2-nitro- anion
- Formula: C8H9NO2-
- Molecular weight: 151.1631

Gas phase thermochemistry data

Data compiled by: John E. Bartmess
Quantity | Value | Units | Method | Reference | Comment |
---|---|---|---|---|---|
ΔfH°gas | -16.6 ± 1.2 | kcal/mol | R-EA | Fukuda and McIver, 1985 | ΔGea(355 K) = -18.3 kcal/mol; ΔSea =-1.1, est. from data in Chowdhury, Heinis, et al., 1986 |

Ion clustering data

Data compiled by: John E. Bartmess
Clustering reactions
C8H9NO2- + = C8H9F4NO2Si-
By formula: C8H9NO2- + F4Si = C8H9F4NO2Si-
Quantity | Value | Units | Method | Reference | Comment |
---|---|---|---|---|---|
ΔrG° | 19.80 ± 0.60 | kcal/mol | IMRE | Williamson, Knighton, et al., 2001 | gas phase; at 150 C |

Reaction thermochemistry data

Data compiled by: John E. Bartmess

Individual Reactions

C8H9NO2- + Silicon tetrafluoride = C8H9F4NO2Si-

By formula: C8H9NO2- + F4Si = C8H9F4NO2Si-

Quantity Value Units Method Reference Comment
Δr19.80 ± 0.60kcal/molIMREWilliamson, Knighton, et al., 2001gas phase; at 150 C

References

Fukuda and McIver, 1985
Fukuda, E.K.; McIver, R.T., Jr.,
Relative electron affinities of substituted benzophenones, nitrobenzenes, and quinones. [Anchored to EA(SO2) from 74CEL/BEN],
J. Am. Chem. Soc., 1985, 107, 2291. [all data]
Chowdhury, Heinis, et al., 1986
Chowdhury, S.; Heinis, T.; Grimsrud, E.P.; Kebarle, P.,
Entropy Changes and Electron Affinities from Gas-Phase Electron Transfer Equilibria: A- + B = A + B-,
J. Phys. Chem., 1986, 90, 12, 2747, https://doi.org/10.1021/j100403a037
. [all data]
Williamson, Knighton, et al., 2001
Williamson, D.H.; Knighton, W.B.; Grimsrud, E.P.,
Lewis acid-base interactions of SiF4 with molecular anions formed by electron capture reactions,
Int. J. Mass Spectrom., 2001, 206, 1-2, 53-61, https://doi.org/10.1016/S1387-3806(00)00388-2
. [all data]