2,3,5-triMe-benzoate anion
- Formula: C10H11O2-
- Molecular weight: 163.1937

Gas phase ion energetics data

Data compiled by: John E. Bartmess
Protonation reactions
By formula: C10H11O2- + H+ = C10H12O2
Quantity | Value | Units | Method | Reference | Comment |
---|---|---|---|---|---|
ΔrG° | 332.1 ± 2.1 | kcal/mol | IMRE | Decouzon, Gal, et al., 1997 | gas phase |

References

Decouzon, Gal, et al., 1997
Decouzon, M.; Gal, J.-F.; Maria, P.-C.; Bohm, S.; Jimenez, P.; Roux, M.V.; Exner, O.,
Steric Effects in Crowded Molecules in the Gas Phase: Polymethyl Substituted Benzoic Acids,
New J. Chem., 1997, 21, 561. [all data]