2,4,6-Trimethylbenzaldehyde anion
- Formula: C10H12O-
- Molecular weight: 148.2022

Gas phase thermochemistry data

Data compiled by: John E. Bartmess
Quantity | Value | Units | Method | Reference | Comment |
---|---|---|---|---|---|
ΔfH°gas | -175. ± 5.9 | kJ/mol | R-EA | Wentworth and Ristau, 1969 |

References

Wentworth and Ristau, 1969
Wentworth, W.E.; Ristau, W.,
Thermal Electron Attachment Involving a Change in Molecular Geometry,
J. Phys. Chem., 1969, 73, 7, 2126, https://doi.org/10.1021/j100727a005
. [all data]