(LuCl3)5..LuCl4 anion
- Formula: Cl19Lu6-
- Molecular weight: 1723.408

Gas phase thermochemistry data

Data compiled by: John E. Bartmess
Quantity | Value | Units | Method | Reference | Comment |
---|---|---|---|---|---|
ΔfH°gas | -1407.17 | kcal/mol | Ther | Pogrebnoi, Kudion, et al., 1997 | value altered from reference due to conversion from electron convention to ion convention |

Reaction thermochemistry data

Data compiled by: John E. Bartmess
Individual Reactions
By formula: Cl16Lu5- + 5Cl3Lu = Cl19Lu6-
Quantity | Value | Units | Method | Reference | Comment |
---|---|---|---|---|---|
ΔrH° | 95. ± 23. | kcal/mol | TDAs | Pogrebnoi, Kudion, et al., 1997 | gas phase; value altered from reference due to conversion from electron convention to ion convention |

Ion clustering data

Data compiled by: John E. Bartmess
Clustering reactions
By formula: Cl16Lu5- + 5Cl3Lu = Cl19Lu6-
Quantity | Value | Units | Method | Reference | Comment |
---|---|---|---|---|---|
ΔrH° | 95. ± 23. | kcal/mol | TDAs | Pogrebnoi, Kudion, et al., 1997 | gas phase; value altered from reference due to conversion from electron convention to ion convention |

References

Pogrebnoi, Kudion, et al., 1997
Pogrebnoi, A.; Kudion, L.S.; Kuznetsov, A.Yu.; Butman, M.F.,
Molecular and Ionic Clusters in Saturated Vapor over Lutetium Trichloride,
Rapid Commun. Mass Spectrom., 1997, 11, 14, 1536, https://doi.org/10.1002/(SICI)1097-0231(199709)11:14<1536::AID-RCM31>3.0.CO;2-D
. [all data]