(LuCl3)3..LuCl4 anion
- Formula: Cl13Lu4-
- Molecular weight: 1160.757

Gas phase thermochemistry data

Data compiled by: John E. Bartmess
Quantity | Value | Units | Method | Reference | Comment |
---|---|---|---|---|---|
ΔfH°gas | -947.49 | kcal/mol | Ther | Pogrebnoi, Kudion, et al., 1997 | value altered from reference due to conversion from electron convention to ion convention |

Reaction thermochemistry data

Data compiled by: John E. Bartmess
Individual Reactions
By formula: Cl10Lu3- + 3Cl3Lu = Cl13Lu4-
Quantity | Value | Units | Method | Reference | Comment |
---|---|---|---|---|---|
ΔrH° | 75.3 ± 5.3 | kcal/mol | TDAs | Pogrebnoi, Kudion, et al., 1997 | gas phase; value altered from reference due to conversion from electron convention to ion convention |
By formula: Cl13Lu4- + 4Cl3Lu = Cl16Lu5-
Quantity | Value | Units | Method | Reference | Comment |
---|---|---|---|---|---|
ΔrH° | 45. ± 19. | kcal/mol | TDAs | Pogrebnoi, Kudion, et al., 1997 | gas phase; value altered from reference due to conversion from electron convention to ion convention |

Ion clustering data

Data compiled by: John E. Bartmess
Clustering reactions
By formula: Cl10Lu3- + 3Cl3Lu = Cl13Lu4-
Quantity | Value | Units | Method | Reference | Comment |
---|---|---|---|---|---|
ΔrH° | 75.3 ± 5.3 | kcal/mol | TDAs | Pogrebnoi, Kudion, et al., 1997 | gas phase; value altered from reference due to conversion from electron convention to ion convention |
By formula: Cl13Lu4- + 4Cl3Lu = Cl16Lu5-
Quantity | Value | Units | Method | Reference | Comment |
---|---|---|---|---|---|
ΔrH° | 45. ± 19. | kcal/mol | TDAs | Pogrebnoi, Kudion, et al., 1997 | gas phase; value altered from reference due to conversion from electron convention to ion convention |

References

Pogrebnoi, Kudion, et al., 1997
Pogrebnoi, A.; Kudion, L.S.; Kuznetsov, A.Yu.; Butman, M.F.,
Molecular and Ionic Clusters in Saturated Vapor over Lutetium Trichloride,
Rapid Commun. Mass Spectrom., 1997, 11, 14, 1536, https://doi.org/10.1002/(SICI)1097-0231(199709)11:14<1536::AID-RCM31>3.0.CO;2-D
. [all data]