LuCl3..Cl anion
- Formula: Cl4Lu-
- Molecular weight: 316.779

Gas phase thermochemistry data

Data compiled by: John E. Bartmess
Quantity | Value | Units | Method | Reference | Comment |
---|---|---|---|---|---|
ΔfH°gas | -285.22 | kcal/mol | Ther | Pogrebnoi, Kudion, et al., 1997 | EA estimated as 3.7±1.0 eV; value altered from reference due to conversion from electron convention to ion convention |
ΔfH°gas | -308.7 ± 2.9 | kcal/mol | Ther | Kudin, Vorob'ev, et al., 2007 | value altered from reference due to conversion from electron convention to ion convention |

Reaction thermochemistry data

Data compiled by: John E. Bartmess
Individual Reactions
By formula: Cl4Lu- + Cl3Lu = Cl7Lu2-
Quantity | Value | Units | Method | Reference | Comment |
---|---|---|---|---|---|
ΔrH° | 49.5 ± 2.4 | kcal/mol | TDAs | Pogrebnoi, Kudion, et al., 1997 | gas phase; value altered from reference due to conversion from electron convention to ion convention |
ΔrH° | 61.2 ± 7.9 | kcal/mol | TDEq | Kudin, Vorob'ev, et al., 2007 | gas phase; value altered from reference due to conversion from electron convention to ion convention |

Ion clustering data

Data compiled by: John E. Bartmess
Clustering reactions
By formula: Cl4Lu- + Cl3Lu = Cl7Lu2-
Quantity | Value | Units | Method | Reference | Comment |
---|---|---|---|---|---|
ΔrH° | 49.5 ± 2.4 | kcal/mol | TDAs | Pogrebnoi, Kudion, et al., 1997 | gas phase; value altered from reference due to conversion from electron convention to ion convention |
ΔrH° | 61.2 ± 7.9 | kcal/mol | TDEq | Kudin, Vorob'ev, et al., 2007 | gas phase; value altered from reference due to conversion from electron convention to ion convention |

References

Pogrebnoi, Kudion, et al., 1997
Pogrebnoi, A.; Kudion, L.S.; Kuznetsov, A.Yu.; Butman, M.F.,
Molecular and Ionic Clusters in Saturated Vapor over Lutetium Trichloride,
Rapid Commun. Mass Spectrom., 1997, 11, 14, 1536, https://doi.org/10.1002/(SICI)1097-0231(199709)11:14<1536::AID-RCM31>3.0.CO;2-D
. [all data]
Kudin, Vorob'ev, et al., 2007
Kudin, L.S.; Vorob'ev, D.E.; Grishin, A.E.,
The Thermochemical Characteristics of the LnCl4- and Ln2Cl7- Negative Ions,
Russ. J. Phys. Chem., 2007, 81, 2, 147, https://doi.org/10.1134/S003602440702001X
. [all data]