(H2O)2..adenosine-5'-O2POPO2(OH) dianion
- Formula: C10H17N5O12P2-2
- Molecular weight: 461.2169

Reaction thermochemistry data

Data compiled by: John E. Bartmess
Individual Reactions
CAS Reg. No. 73679-94-4 + 2 = C10H17N5O12P2-2
By formula: CAS Reg. No. 73679-94-4 + 2H2O = C10H17N5O12P2-2
Quantity | Value | Units | Method | Reference | Comment |
---|---|---|---|---|---|
ΔrG° | 7.90 ± 0.20 | kcal/mol | IMRE | Blades, Ho, et al., 1996 | gas phase |

References

Blades, Ho, et al., 1996
Blades, A.T.; Ho, Y.; Kebarle, P.,
Free Energies of Hydration in the Gas Phase of Some Phosphate Singly and Doubly Charged Anions: orthophosphate, diphosphate, Ribose-5-phosphate, Adenosine-5'-phosphate and Adenosine-5'-Dipho,
J. Phys. Chem., 1996, 100, 6, 2443, https://doi.org/10.1021/jp952032s
. [all data]