(H2O)4..(HO)O2POPO2(OH) dianion
- Formula: H10O11P2-2
- Molecular weight: 248.0214

Reaction thermochemistry data

Data compiled by: John E. Bartmess
Individual Reactions
CAS Reg. No. 15251-42-0 + 4 = H10O11P2-2
By formula: CAS Reg. No. 15251-42-0 + 4H2O = H10O11P2-2
Quantity | Value | Units | Method | Reference | Comment |
---|---|---|---|---|---|
ΔrG° | 7.90 ± 0.20 | kcal/mol | IMRE | Blades, Ho, et al., 1996 | gas phase |

References

Blades, Ho, et al., 1996
Blades, A.T.; Ho, Y.; Kebarle, P.,
Free Energies of Hydration in the Gas Phase of Some Phosphate Singly and Doubly Charged Anions: orthophosphate, diphosphate, Ribose-5-phosphate, Adenosine-5'-phosphate and Adenosine-5'-Dipho,
J. Phys. Chem., 1996, 100, 6, 2443, https://doi.org/10.1021/jp952032s
. [all data]