H2O..D-ribose-5-OPO3 anion

Reaction thermochemistry data

Data compiled by: John E. Bartmess

Individual Reactions

CAS Reg. No. 207592-41-4 + Water = C5H10O9P-

By formula: CAS Reg. No. 207592-41-4 + H2O = C5H10O9P-

Quantity Value Units Method Reference Comment
Δr24.3 ± 0.84kJ/molIMREBlades, Ho, et al., 1996gas phase

References

Blades, Ho, et al., 1996
Blades, A.T.; Ho, Y.; Kebarle, P., Free Energies of Hydration in the Gas Phase of Some Phosphate Singly and Doubly Charged Anions: orthophosphate, diphosphate, Ribose-5-phosphate, Adenosine-5'-phosphate and Adenosine-5'-Dipho, J. Phys. Chem., 1996, 100, 6, 2443, https://doi.org/10.1021/jp952032s . [all data]