(H2O)4..HCO3 anion
- Formula: CH9O7-
- Molecular weight: 133.0785

Gas phase thermochemistry data

Data compiled by: John E. Bartmess
Quantity | Value | Units | Method | Reference | Comment |
---|---|---|---|---|---|
ΔfH°gas | -1953.6 | kJ/mol | Ther | Keesee, Lee, et al., 1979 |

Ion clustering data

Data compiled by: John E. Bartmess
Clustering reactions
CH7O6- + 4 = CH9O7-
By formula: CH7O6- + 4H2O = CH9O7-
Quantity | Value | Units | Method | Reference | Comment |
---|---|---|---|---|---|
ΔrH° | 56.1 ± 3.8 | kJ/mol | TDAs | Keesee, Lee, et al., 1979 | gas phase |
Quantity | Value | Units | Method | Reference | Comment |
ΔrG° | 14. ± 4.2 | kJ/mol | TDAs | Keesee, Lee, et al., 1979 | gas phase |

Reaction thermochemistry data

Data compiled by: John E. Bartmess

Individual Reactions

CH7O6- + 4Water = CH9O7-

By formula: CH7O6- + 4H2O = CH9O7-

Quantity Value Units Method Reference Comment
Δr13.40 ± 0.90kcal/molTDAsKeesee, Lee, et al., 1979gas phase
Quantity Value Units Method Reference Comment
Δr3.4 ± 1.0kcal/molTDAsKeesee, Lee, et al., 1979gas phase

References

Keesee, Lee, et al., 1979
Keesee, R.G.; Lee, N.; Castleman Jr.,
Properties of Clusters in the Gas Phase. 3. Hydration Complexes of CO3- and HCO3-,
J. Am. Chem. Soc., 1979, 101, 10, 2599, https://doi.org/10.1021/ja00504a015
. [all data]