(H2O)3..HCO3 anion
- Formula: CH7O6-
- Molecular weight: 115.0632

Gas phase thermochemistry data

Data compiled by: John E. Bartmess
Quantity | Value | Units | Method | Reference | Comment |
---|---|---|---|---|---|
ΔfH°gas | -1655.7 | kJ/mol | Ther | Keesee, Lee, et al., 1979 |

Ion clustering data

Data compiled by: John E. Bartmess
Clustering reactions
CH5O5- + 3 = CH7O6-
By formula: CH5O5- + 3H2O = CH7O6-
Quantity | Value | Units | Method | Reference | Comment |
---|---|---|---|---|---|
ΔrH° | 56.9 ± 1.3 | kJ/mol | TDAs | Keesee, Lee, et al., 1979 | gas phase |
Quantity | Value | Units | Method | Reference | Comment |
ΔrG° | 19. ± 4.2 | kJ/mol | TDAs | Keesee, Lee, et al., 1979 | gas phase |
CH7O6- + 4 = CH9O7-
By formula: CH7O6- + 4H2O = CH9O7-
Quantity | Value | Units | Method | Reference | Comment |
---|---|---|---|---|---|
ΔrH° | 56.1 ± 3.8 | kJ/mol | TDAs | Keesee, Lee, et al., 1979 | gas phase |
Quantity | Value | Units | Method | Reference | Comment |
ΔrG° | 14. ± 4.2 | kJ/mol | TDAs | Keesee, Lee, et al., 1979 | gas phase |

Reaction thermochemistry data

Data compiled by: John E. Bartmess

Individual Reactions

CH5O5- + 3Water = CH7O6-

By formula: CH5O5- + 3H2O = CH7O6-

Quantity Value Units Method Reference Comment
Δr56.9 ± 1.3kJ/molTDAsKeesee, Lee, et al., 1979gas phase
Quantity Value Units Method Reference Comment
Δr19. ± 4.2kJ/molTDAsKeesee, Lee, et al., 1979gas phase

CH7O6- + 4Water = CH9O7-

By formula: CH7O6- + 4H2O = CH9O7-

Quantity Value Units Method Reference Comment
Δr56.1 ± 3.8kJ/molTDAsKeesee, Lee, et al., 1979gas phase
Quantity Value Units Method Reference Comment
Δr14. ± 4.2kJ/molTDAsKeesee, Lee, et al., 1979gas phase

References

Keesee, Lee, et al., 1979
Keesee, R.G.; Lee, N.; Castleman Jr.,
Properties of Clusters in the Gas Phase. 3. Hydration Complexes of CO3- and HCO3-,
J. Am. Chem. Soc., 1979, 101, 10, 2599, https://doi.org/10.1021/ja00504a015
. [all data]