(H2O)2..HCO3 anion
- Formula: CH5O5-
- Molecular weight: 97.0479

Gas phase thermochemistry data

Data compiled by: John E. Bartmess
Quantity | Value | Units | Method | Reference | Comment |
---|---|---|---|---|---|
ΔfH°gas | -324.31 | kcal/mol | Ther | Keesee, Lee, et al., 1979 |

Ion clustering data

Data compiled by: John E. Bartmess
Clustering reactions
CH3O4- + 2 = CH5O5-
By formula: CH3O4- + 2H2O = CH5O5-
Quantity | Value | Units | Method | Reference | Comment |
---|---|---|---|---|---|
ΔrH° | 14.90 ± 0.20 | kcal/mol | TDAs | Keesee, Lee, et al., 1979 | gas phase |
Quantity | Value | Units | Method | Reference | Comment |
ΔrG° | 6.2 ± 1.0 | kcal/mol | TDAs | Keesee, Lee, et al., 1979 | gas phase |
CH5O5- + 3 = CH7O6-
By formula: CH5O5- + 3H2O = CH7O6-
Quantity | Value | Units | Method | Reference | Comment |
---|---|---|---|---|---|
ΔrH° | 13.60 ± 0.30 | kcal/mol | TDAs | Keesee, Lee, et al., 1979 | gas phase |
Quantity | Value | Units | Method | Reference | Comment |
ΔrG° | 4.5 ± 1.0 | kcal/mol | TDAs | Keesee, Lee, et al., 1979 | gas phase |

References

Keesee, Lee, et al., 1979
Keesee, R.G.; Lee, N.; Castleman Jr.,
Properties of Clusters in the Gas Phase. 3. Hydration Complexes of CO3- and HCO3-,
J. Am. Chem. Soc., 1979, 101, 10, 2599, https://doi.org/10.1021/ja00504a015
. [all data]