(H2O)2..CO3 radical anion
- Formula: CH4O5-
- Molecular weight: 96.0400

Gas phase thermochemistry data

Data compiled by: John E. Bartmess
Quantity | Value | Units | Method | Reference | Comment |
---|---|---|---|---|---|
ΔfH°gas | -1103.8 | kJ/mol | Ther | Keesee, Lee, et al., 1979 |

Ion clustering data

Data compiled by: John E. Bartmess
Clustering reactions
CH2O4- + 2 = CH4O5-
By formula: CH2O4- + 2H2O = CH4O5-
Quantity | Value | Units | Method | Reference | Comment |
---|---|---|---|---|---|
ΔrH° | 56.9 ± 2.1 | kJ/mol | TDAs | Keesee, Lee, et al., 1979 | gas phase |
Quantity | Value | Units | Method | Reference | Comment |
ΔrG° | 20. ± 4.2 | kJ/mol | TDAs | Keesee, Lee, et al., 1979 | gas phase |
CH4O5- + 3 = CH6O6-
By formula: CH4O5- + 3H2O = CH6O6-
Quantity | Value | Units | Method | Reference | Comment |
---|---|---|---|---|---|
ΔrH° | 54.8 ± 3.3 | kJ/mol | TDAs | Keesee, Lee, et al., 1979 | gas phase |
Quantity | Value | Units | Method | Reference | Comment |
ΔrG° | 14. ± 4.2 | kJ/mol | TDAs | Keesee, Lee, et al., 1979 | gas phase |

Reaction thermochemistry data

Data compiled by: John E. Bartmess

Individual Reactions

CH4O5- + 3Water = CH6O6-

By formula: CH4O5- + 3H2O = CH6O6-

Quantity Value Units Method Reference Comment
Δr54.8 ± 3.3kJ/molTDAsKeesee, Lee, et al., 1979gas phase
Quantity Value Units Method Reference Comment
Δr14. ± 4.2kJ/molTDAsKeesee, Lee, et al., 1979gas phase

CH2O4- + 2Water = CH4O5-

By formula: CH2O4- + 2H2O = CH4O5-

Quantity Value Units Method Reference Comment
Δr56.9 ± 2.1kJ/molTDAsKeesee, Lee, et al., 1979gas phase
Quantity Value Units Method Reference Comment
Δr20. ± 4.2kJ/molTDAsKeesee, Lee, et al., 1979gas phase

References

Keesee, Lee, et al., 1979
Keesee, R.G.; Lee, N.; Castleman Jr.,
Properties of Clusters in the Gas Phase. 3. Hydration Complexes of CO3- and HCO3-,
J. Am. Chem. Soc., 1979, 101, 10, 2599, https://doi.org/10.1021/ja00504a015
. [all data]