(MeCO2H)3..MeCO2 anion
- Formula: C8H15O8-
- Molecular weight: 239.2004

Gas phase thermochemistry data

Data compiled by: John E. Bartmess
Quantity | Value | Units | Method | Reference | Comment |
---|---|---|---|---|---|
ΔfH°gas | -492.1 ± 3.4 | kcal/mol | Ther | Meot-ner, Elmore, et al., 1999 | |
ΔfH°gas | -495.8 ± 3.5 | kcal/mol | Ther | Meot-Ner and Sieck, 1986 |

Ion clustering data

Data compiled by: John E. Bartmess
Clustering reactions
C8H15O8- + 3 +
= C8H17O9-
By formula: C8H15O8- + 3H2O + H2O = C8H17O9-
Quantity | Value | Units | Method | Reference | Comment |
---|---|---|---|---|---|
ΔrH° | 8.9 ± 1.0 | kcal/mol | N/A | Meot-ner, Elmore, et al., 1999 | gas phase |
Quantity | Value | Units | Method | Reference | Comment |
ΔrG° | 0.64 | kcal/mol | TDAs | Meot-ner, Elmore, et al., 1999 | gas phase |

References

Meot-ner, Elmore, et al., 1999
Meot-ner, M.; Elmore, D.E.; Scheiner, S.,
Ionic Hydrogen Bond Effects on the Acidities, Basicities, Solvation, Solvent Bridging and Self-assembly of Carboxylic Groups,
J. Am. Chem. Soc., 1999, 121, 33, 7625, https://doi.org/10.1021/ja982173i
. [all data]
Meot-Ner and Sieck, 1986
Meot-Ner, M.; Sieck, L.W.,
The ionic hydrogen bond and ion solvation. 5. OH...O- bonds. Gas phase solvation and clustering of alkoxide and carboxylate anions,
J. Am. Chem. Soc., 1986, 108, 7525. [all data]