(MeCO2H)2..MeCO2 anion
- Formula: C6H11O6-
- Molecular weight: 179.1485

Gas phase thermochemistry data

Data compiled by: John E. Bartmess
Quantity | Value | Units | Method | Reference | Comment |
---|---|---|---|---|---|
ΔfH°gas | -1574. ± 14. | kJ/mol | Ther | Meot-ner, Elmore, et al., 1999 | |
ΔfH°gas | -1559. ± 14. | kJ/mol | Ther | Meot-Ner and Sieck, 1986 |

Ion clustering data

Data compiled by: John E. Bartmess
Clustering reactions
C6H11O6- + 2 + 2
= C6H13O7-
By formula: C6H11O6- + 2H2O + 2H2O = C6H13O7-
Quantity | Value | Units | Method | Reference | Comment |
---|---|---|---|---|---|
ΔrH° | 38.1 ± 1.7 | kJ/mol | N/A | Meot-ner, Elmore, et al., 1999 | gas phase |
Quantity | Value | Units | Method | Reference | Comment |
ΔrG° | 11.6 | kJ/mol | TDAs | Meot-ner, Elmore, et al., 1999 | gas phase |

Reaction thermochemistry data

Data compiled by: John E. Bartmess

Individual Reactions

C6H11O6- + 2Water + 2Water = C6H13O7-

By formula: C6H11O6- + 2H2O + 2H2O = C6H13O7-

Quantity Value Units Method Reference Comment
Δr9.10 ± 0.40kcal/molN/AMeot-ner, Elmore, et al., 1999gas phase
Quantity Value Units Method Reference Comment
Δr2.78kcal/molTDAsMeot-ner, Elmore, et al., 1999gas phase

References

Meot-ner, Elmore, et al., 1999
Meot-ner, M.; Elmore, D.E.; Scheiner, S.,
Ionic Hydrogen Bond Effects on the Acidities, Basicities, Solvation, Solvent Bridging and Self-assembly of Carboxylic Groups,
J. Am. Chem. Soc., 1999, 121, 33, 7625, https://doi.org/10.1021/ja982173i
. [all data]
Meot-Ner and Sieck, 1986
Meot-Ner, M.; Sieck, L.W.,
The ionic hydrogen bond and ion solvation. 5. OH...O- bonds. Gas phase solvation and clustering of alkoxide and carboxylate anions,
J. Am. Chem. Soc., 1986, 108, 7525. [all data]