(HCl)4..Cl anion
- Formula: Cl5H4-
- Molecular weight: 181.297

Gas phase thermochemistry data

Data compiled by: John E. Bartmess
Quantity | Value | Units | Method | Reference | Comment |
---|---|---|---|---|---|
ΔfH°gas | -103.32 | kcal/mol | Ther | Yamdagni and Kebarle, 1974 |

References

Yamdagni and Kebarle, 1974
Yamdagni, R.; Kebarle, P.,
The hydrogen bond energies in ClHCl- and Cl-(HCl)n,
Can. J. Chem., 1974, 52, 2449. [all data]