H2O..{HCN}..CN anion
- Formula: C2H3N2O-
- Molecular weight: 71.0586

Gas phase thermochemistry data

Data compiled by: John E. Bartmess
Quantity | Value | Units | Method | Reference | Comment |
---|---|---|---|---|---|
ΔfH°gas | -44.1 ± 1.4 | kcal/mol | Ther | Meot-Ner (Mautner) M. and Speller, 1989 |

References

Meot-Ner (Mautner) M. and Speller, 1989
Meot-Ner (Mautner) M.; Speller, C.V.,
Multicomponent Cluster Ions. 2. Comparative Stabilities of Cationic and Anionic Hydrogen Bonded Networks. Mixed Clusters of Water and Hydrogen Cyanide,
J. Phys. Chem., 1989, 93, 9, 3663, https://doi.org/10.1021/j100346a058
. [all data]