(H2O)6..HO anion

Gas phase thermochemistry data

Data compiled by: John E. Bartmess

Quantity Value Units Method Reference Comment
Δfgas-1983.9kJ/molTherMeot-Ner (Mautner) and Speller, 1986

References

Meot-Ner (Mautner) and Speller, 1986
Meot-Ner (Mautner), M.; Speller, C.V., The Filling of Solvent Shells in Cluster Ions: Thermochemical Criteria nd the Effects of Isomeric Clusters, J. Phys. Chem., 1986, 90, 25, 6616, https://doi.org/10.1021/j100283a006 . [all data]