(HNO3)6..NO3 anion
- Formula: H6N7O21-
- Molecular weight: 440.0825

Gas phase thermochemistry data

Data compiled by: John E. Bartmess
Quantity | Value | Units | Method | Reference | Comment |
---|---|---|---|---|---|
ΔfH°gas | -347.9 ± 3.9 | kcal/mol | Ther | Wlodek, Luczynski, et al., 1980 |

References

Wlodek, Luczynski, et al., 1980
Wlodek, S.; Luczynski, Z.; Wincel, H.,
Stabilities of gas-phase NO3-.(HNO3)n,n ≤ 6, clusters,
Int. J. Mass Spectrom. Ion Phys., 1980, 35, 39. [all data]