Germyl iodide
- Formula: GeH3I
- Molecular weight: 202.57
- IUPAC Standard InChIKey: BLKGAIXEHBVDMC-UHFFFAOYSA-N
- Chemical structure:
View 3d structure (requires JavaScript / HTML 5) - Permanent link for this species. Use this link for bookmarking this species for future reference.

Vibrational and/or electronic energy levels

Data compiled by: Takehiko Shimanouchi
Symmetry: C3ν Symmetry Number σ = 3
Sym. | No | Approximate | Selected Freq. | Infrared | Raman | Comments | ||||
---|---|---|---|---|---|---|---|---|---|---|
Species | type of mode | Value | Rating | Value | Phase | Value | Phase | |||
a1 | 1 | GeH3 s-str | 2110 | C | 2110.1 | gas | ||||
a1 | 2 | GeH3 s-deform | 808 | C | 808.2 | gas | ||||
a1 | 3 | GeI str | 248 | C | 248.2 | gas | ||||
e | 4 | GeH3 d-str | 2121 | B | 2120.8 | gas | ||||
e | 5 | GeH3 d-deform | 854 | B | 853.6 | gas | ||||
e | 6 | GeH3 rock | 558 | B | 558.3 | gas | ||||
Source: Shimanouchi, 1972

References

Shimanouchi, 1972
Shimanouchi, T.,
Tables of Molecular Vibrational Frequencies Consolidated Volume II,
J. Phys. Chem. Ref. Data, 1972, 6, 3, 993-1102. [all data]