Dichlorofluoroammonia
- Formula: Cl2FN
- Molecular weight: 103.911
- IUPAC Standard InChIKey: DYAUTDTXTDZNOO-UHFFFAOYSA-N
- Chemical structure:
View 3d structure (requires JavaScript / HTML 5) - Permanent link for this species. Use this link for bookmarking this species for future reference.

Vibrational and/or electronic energy levels

Data compiled by: Takehiko Shimanouchi
Symmetry: Cs Symmetry Number σ = 1
Sym. | No | Approximate | Selected Freq. | Infrared | Raman | Comments | ||||
---|---|---|---|---|---|---|---|---|---|---|
Species | type of mode | Value | Rating | Value | Phase | Value | Phase | |||
a' | 1 | NF str | 825 | C | 825 S | gas | ||||
a' | 2 | NCl2 s-str | 615 | C | 615 M | gas | ||||
a' | 3 | NFCl s-deform | 409 | C | 409 W | gas | ||||
a' | 4 | NCl2 deform | 274 | C | 274 W | gas | ||||
a | 5 | NCl2 a-str | 692 | C | 692 S | gas | ||||
a | 6 | NFCl a-deform | 344 | C | 344 M | gas | ||||
Source: Shimanouchi, 1972

References

Shimanouchi, 1972
Shimanouchi, T.,
Tables of Molecular Vibrational Frequencies Consolidated Volume II,
J. Phys. Chem. Ref. Data, 1972, 6, 3, 993-1102. [all data]