Difluoro disulphane
- Formula: F2S2
- Molecular weight: 102.127
- IUPAC Standard InChIKey: DKDSFVCSLPKNPV-UHFFFAOYSA-N
- Chemical structure:
View 3d structure (requires JavaScript / HTML 5) - Species with the same structure:

Vibrational and/or electronic energy levels

Data compiled by: Takehiko Shimanouchi
Symmetry: C2 Symmetry Number σ = 2
Sym. | No | Approximate | Selected Freq. | Infrared | Raman | Comments | ||||
---|---|---|---|---|---|---|---|---|---|---|
Species | type of mode | Value | Rating | Value | Phase | Value | Phase | |||
a | 1 | SF str | 717 | B | 717.0 | gas | ||||
a | 2 | SS str | 615 | B | 614.6 | gas | p | solid | ||
a | 3 | SF bend | 320 | B | 319.8 | gas | p | solid | ||
a | 4 | Torsion | 183 | C | 182.5 | gas | p | solid | ||
b | 5 | SF str | 681 | B | 680.8 | gas | solid | |||
b | 6 | SF bend | 301 | C | 301 | gas | dp | solid | ||
Source: Shimanouchi, 1972

References

Shimanouchi, 1972
Shimanouchi, T.,
Tables of Molecular Vibrational Frequencies Consolidated Volume II,
J. Phys. Chem. Ref. Data, 1972, 6, 3, 993-1102. [all data]