Hydrogen persulfide
- Formula: H2S2
- Molecular weight: 66.146
- IUPAC Standard InChIKey: BWGNESOTFCXPMA-UHFFFAOYSA-N
- Chemical structure:
View 3d structure (requires JavaScript / HTML 5) - Species with the same structure:

Vibrational and/or electronic energy levels

Data compiled by: Takehiko Shimanouchi
Symmetry: C2 Symmetry Number σ = 2
Sym. | No | Approximate | Selected Freq. | Infrared | Raman | Comments | ||||
---|---|---|---|---|---|---|---|---|---|---|
Species | type of mode | Value | Rating | Value | Phase | Value | Phase | |||
a | 1 | SH str | 2556 | A | 2555.78 | gas | 2509 dp | liq. | ||
a | 2 | SH bend | 883 | D | 883 dp | liq. | ||||
a | 3 | SS str | 509 | D | 509 | liq. | ||||
a | 4 | Torsion | 416 | B | 416 | gas | ||||
b | 5 | SH str | 2559 | A | 2558.64 | gas | ||||
b | 6 | SH bend | 886 | C | 886 | gas | ||||
Source: Shimanouchi, 1972

References

Shimanouchi, 1972
Shimanouchi, T.,
Tables of Molecular Vibrational Frequencies Consolidated Volume II,
J. Phys. Chem. Ref. Data, 1972, 6, 3, 993-1102. [all data]