Carbon dioxide (12C16O2)
- Formula: 12C16O2
- Molecular weight: 43.9898292
- IUPAC Standard InChIKey: CURLTUGMZLYLDI-SXRZRGFPSA-N
- Chemical structure:
View 3d structure (requires JavaScript / HTML 5) - Isotopologues:

Vibrational and/or electronic energy levels

Data compiled by: Takehiko Shimanouchi
Symmetry: D∞h Symmetry Number σ = 2
Sym. | No | Approximate | Selected Freq. | Infrared | Raman | Comments | ||||
---|---|---|---|---|---|---|---|---|---|---|
Species | type of mode | Value | Rating | Value | Phase | Value | Phase | |||
σg+ | 1 | Sym str | 1333 | C | ia | 1388.15 | gas | FR(2ν2) | ||
σg+ | 1 | Sym str | 1333 | C | ia | 1285.40 | gas | FR(2ν2) | ||
πu | 2 | Bend | 667 | A | 667.38 S | gas | ia | |||
σu+ | 3 | Anti str | 2349 | A | 2349.16 VS | gas | ia | |||
Source: Shimanouchi, 1972

References

Shimanouchi, 1972
Shimanouchi, T.,
Tables of Molecular Vibrational Frequencies Consolidated Volume I, National Bureau of Standards, 1972, 1-160. [all data]