Te anion
- Formula: Te-
- Molecular weight: 127.60

Gas phase thermochemistry data

Data compiled by: John E. Bartmess
Quantity | Value | Units | Method | Reference | Comment |
---|---|---|---|---|---|
ΔfH°gas | 6.57 | kJ/mol | R-EA | Haeffler, Klinkmüller, et al., 1996 | Given: 1.970876(7) eV |

Gas phase ion energetics data

Data compiled by: John E. Bartmess
Protonation reactions
Te- + = HTe
Quantity | Value | Units | Method | Reference | Comment |
---|---|---|---|---|---|
ΔrH° | 1392.6 ± 2.1 | kJ/mol | D-EA | Haeffler, Klinkmüller, et al., 1996 | gas phase; Given: 1.970876(7) eV |

Reaction thermochemistry data

Data compiled by: John E. Bartmess
Individual Reactions
Te- + = HTe
Quantity | Value | Units | Method | Reference | Comment |
---|---|---|---|---|---|
ΔrH° | 332.85 ± 0.50 | kcal/mol | D-EA | Haeffler, Klinkmüller, et al., 1996 | gas phase; Given: 1.970876(7) eV |

References

Haeffler, Klinkmüller, et al., 1996
Haeffler, G.; Klinkmüller, A.E.; Rangell, J.; Berzinsh, U.; Hanstorp, D.,
The Electron Affinity of Tellurium,
Z. Phys. D, 1996, 38, 3, 211, https://doi.org/10.1007/s004600050085
. [all data]