(MeNO2)2..MeNO2 radical anion
- Formula: C3H9N3O6-
- Molecular weight: 183.1206

Gas phase thermochemistry data

Data compiled by: John E. Bartmess
Quantity | Value | Units | Method | Reference | Comment |
---|---|---|---|---|---|
ΔfH°gas | -86. ± 35. | kcal/mol | Ther | Compton, Carman Jr., et al., 1996 | shift in electron detachment from less solvated ion |
ΔfH°gas | -85.25 ± 0.43 | kcal/mol | Ther | Wincel, 2003 |

Ion clustering data

Data compiled by: John E. Bartmess
Clustering reactions
C3H9N3O6- + 3 = C4H12N4O8-
By formula: C3H9N3O6- + 3CH3NO2 = C4H12N4O8-
Quantity | Value | Units | Method | Reference | Comment |
---|---|---|---|---|---|
ΔrH° | 10.40 ± 0.50 | kcal/mol | TDAs | Wincel, 2003 | gas phase |
Quantity | Value | Units | Method | Reference | Comment |
ΔrG° | 3.80 | kcal/mol | TDAs | Wincel, 2003 | gas phase |

Gas phase ion energetics data

Data compiled by: John E. Bartmess
Electron affinity of neutral species
EAneutral (eV) | Method | Reference | Comment |
---|---|---|---|
1.252 ± 0.020 | LPES | Compton, Carman Jr., et al., 1996 | shift in electron detachment from less solvated ion |

Reaction thermochemistry data

Data compiled by: John E. Bartmess

Individual Reactions

C3H9N3O6- + 3Methane, nitro- = C4H12N4O8-

By formula: C3H9N3O6- + 3CH3NO2 = C4H12N4O8-

Quantity Value Units Method Reference Comment
Δr10.40 ± 0.50kcal/molTDAsWincel, 2003gas phase
Quantity Value Units Method Reference Comment
Δr3.80kcal/molTDAsWincel, 2003gas phase

References

Compton, Carman Jr., et al., 1996
Compton, R.N.; Carman Jr.; Desfrancois, C.; Abdoul-Carmine, H.; Schermann, J.P.; Hendricks, J.H.,
On the binding of Electrons to Nitromethane: Dipole and Valence Bound Anions,
J. Chem. Phys., 1996, 105, 9, 3472, https://doi.org/10.1063/1.472993
. [all data]
Wincel, 2003
Wincel, H.,
Gas-phase Solvation of Cl-, NO2-, CH2NO2-, CH3NO2-, and CH3NO4- by CH3NO2,
Int. J. Mass Spectrom., 2003, 226, 3, 341-353, https://doi.org/10.1016/S1387-3806(03)00066-6
. [all data]