(H2O)2..O2 radical anion
- Formula: H4O4-
- Molecular weight: 68.0299

Gas phase thermochemistry data

Data compiled by: John E. Bartmess
Quantity | Value | Units | Method | Reference | Comment |
---|---|---|---|---|---|
ΔfH°gas | -161.6 ± 2.5 | kcal/mol | Ther | Arshadi and Kebarle, 1970 |

Reaction thermochemistry data

Data compiled by: John E. Bartmess
Individual Reactions
H4O4- + + 2
= C10H12O4-
By formula: H4O4- + C10H8 + 2H2O = C10H12O4-
Quantity | Value | Units | Method | Reference | Comment |
---|---|---|---|---|---|
ΔrH° | 52.3 ± 2.3 | kcal/mol | N/A | Le Barbu, Schiedt, et al., 2002 | gas phase; Affinity is difference in EAs of lesser solvated species |

Gas phase ion energetics data

Data compiled by: John E. Bartmess
Electron affinity of neutral species
EAneutral (eV) | Method | Reference | Comment |
---|---|---|---|
2.250 ± 0.050 | LPES | Luong, Clements, et al., 2001 | Vertical Detachment Energy: 2.77±0.05 eV. |

Ion clustering data

Data compiled by: John E. Bartmess
Clustering reactions
H4O4- + + 2
= C10H12O4-
By formula: H4O4- + C10H8 + 2H2O = C10H12O4-
Quantity | Value | Units | Method | Reference | Comment |
---|---|---|---|---|---|
ΔrH° | 52.3 ± 2.3 | kcal/mol | N/A | Le Barbu, Schiedt, et al., 2002 | gas phase; Affinity is difference in EAs of lesser solvated species |

References

Arshadi and Kebarle, 1970
Arshadi, M.; Kebarle, P.,
Hydration of OH- and O2- in the Gas Phase. Comparative Solvation of OH- by Water and the Hydrogen Halides. Effect of Acidity,
J. Phys. Chem., 1970, 74, 7, 1483, https://doi.org/10.1021/j100702a015
. [all data]
Le Barbu, Schiedt, et al., 2002
Le Barbu, K.; Schiedt, J.; Weinkauf, R.; Schlag, E.W.; Nilles, J.M.; Xu, S.J.; Thomas, O.C.; Bowen, K.H.,
Microsolvation of small anions by aromatic molecules: An exploratory study,
J. Chem. Phys., 2002, 116, 22, 9663-9671, https://doi.org/10.1063/1.1475750
. [all data]
Luong, Clements, et al., 2001
Luong, A.K.; Clements, T.G.; Resat, M.S.; Continetti, R.E.,
Energetics and dissociative photodetachment dynamics of superoxide-water clusters: O-2(-)(H2O)(n), n=1-6,
J. Chem. Phys., 2001, 114, 8, 3449-3455, https://doi.org/10.1063/1.1342221
. [all data]