(MeCN)2..Br anion
- Formula: C4H6BrN2-
- Molecular weight: 162.008

Gas phase thermochemistry data

Data compiled by: John E. Bartmess
Quantity | Value | Units | Method | Reference | Comment |
---|---|---|---|---|---|
ΔfH°gas | -161.6 ± 2.7 | kJ/mol | Ther | Hiraoka, Mizuse, et al., 1988 | |
ΔfH°gas | -160.8 ± 3.6 | kJ/mol | Ther | Markovich, Perera, et al., 1996 | |
ΔfH°gas | -162.0 | kJ/mol | Ther | Yamdagni and Kebarle, 1972 |

Gas phase ion energetics data

Data compiled by: John E. Bartmess
Electron affinity of neutral species
EAneutral (eV) | Method | Reference | Comment |
---|---|---|---|
4.404 ± 0.015 | LPES | Markovich, Perera, et al., 1996 |

References

Hiraoka, Mizuse, et al., 1988
Hiraoka, K.; Mizuse, S.; Yamabe, S.,
Solvation of Halide Ions with H2O and CH3CN in the Gas Phase,
J. Phys. Chem., 1988, 92, 13, 3943, https://doi.org/10.1021/j100324a051
. [all data]
Markovich, Perera, et al., 1996
Markovich, G.; Perera, L.; Berkowitz, M.L.; Cheshnovsky, O.,
The Solvation of Cl-, Br-, and I- in Acetonitrile Cluster: Photoelectron Spectroscopy and Molecular Dynamics Simulations.,
J. Chem. Phys., 1996, 105, 7, 2675, https://doi.org/10.1063/1.472131
. [all data]
Yamdagni and Kebarle, 1972
Yamdagni, R.; Kebarle, P.,
Solvation of negative ions by protic and aprotic solvents. Gas phase solvation of halide ions by acetonitrile and water molecules,
J. Am. Chem. Soc., 1972, 94, 2940. [all data]