(MeCN)7..Cl anion
- Formula: C14H21ClN7-
- Molecular weight: 322.817

Gas phase thermochemistry data

Data compiled by: John E. Bartmess
Quantity | Value | Units | Method | Reference | Comment |
---|---|---|---|---|---|
ΔfH°gas | -31.1 | kJ/mol | Ther | Hiraoka, Mizuse, et al., 1988 | |
ΔfH°gas | -8.08 | kJ/mol | Ther | Markovich, Perera, et al., 1996 |

Gas phase ion energetics data

Data compiled by: John E. Bartmess
Electron affinity of neutral species
EAneutral (eV) | Method | Reference | Comment |
---|---|---|---|
6.443 ± 0.025 | LPES | Markovich, Perera, et al., 1996 |

References

Hiraoka, Mizuse, et al., 1988
Hiraoka, K.; Mizuse, S.; Yamabe, S.,
Solvation of Halide Ions with H2O and CH3CN in the Gas Phase,
J. Phys. Chem., 1988, 92, 13, 3943, https://doi.org/10.1021/j100324a051
. [all data]
Markovich, Perera, et al., 1996
Markovich, G.; Perera, L.; Berkowitz, M.L.; Cheshnovsky, O.,
The Solvation of Cl-, Br-, and I- in Acetonitrile Cluster: Photoelectron Spectroscopy and Molecular Dynamics Simulations.,
J. Chem. Phys., 1996, 105, 7, 2675, https://doi.org/10.1063/1.472131
. [all data]