(H2O)4..F anion

Gas phase ion energetics data

Data compiled by: John E. Bartmess

Electron affinity of neutral species

EAneutral (eV) Method Reference Comment
7.35 ± 0.20LPESYang, Wang, et al., 2001Stated electron affinity is the Vertical Detachment Energy

References

Yang, Wang, et al., 2001
Yang, X.; Wang, X.B.; Wang, L.S., Photodetachment of F-(H2O)(n) (n=1-4): Observation of charge- transfer states [F-(H2O)(n)(+)] and the transition state of F+H2O hydrogen abstraction reaction, J. Chem. Phys., 2001, 115, 7, 2889-2892, https://doi.org/10.1063/1.1394758 . [all data]