(H2O)2..HO anion

Gas phase thermochemistry data

Data compiled by: John E. Bartmess

Quantity Value Units Method Reference Comment
Δfgas-808.22kJ/molTherMeot-Ner (Mautner) and Speller, 1986
Δfgas-809.48kJ/molTherPayzant, Yamdagni, et al., 1971

References

Meot-Ner (Mautner) and Speller, 1986
Meot-Ner (Mautner), M.; Speller, C.V., The Filling of Solvent Shells in Cluster Ions: Thermochemical Criteria nd the Effects of Isomeric Clusters, J. Phys. Chem., 1986, 90, 25, 6616, https://doi.org/10.1021/j100283a006 . [all data]

Payzant, Yamdagni, et al., 1971
Payzant, J.D.; Yamdagni, R.; Kebarle, P., Hydration of CN-, NO2-, NO3-, and HO- in the gas phase, Can. J. Chem., 1971, 49, 3308. [all data]