H2O..{SO2}2..Cl anion

Gas phase thermochemistry data

Data compiled by: John E. Bartmess

Quantity Value Units Method Reference Comment
Δfgas-1265.7kJ/molTherUpschulte, Schelling, et al., 1984

References

Upschulte, Schelling, et al., 1984
Upschulte, B.L.; Schelling, F.J.; Keesee, R.G.; Castleman, A.W., Thermochemical Properties of Gas Phase Mixed Clusters: Water and Sulfur Dioxide with Na+ and Cl-, Chem. Phys. Lett., 1984, 111, 4-5, 389, https://doi.org/10.1016/0009-2614(84)85526-8 . [all data]