(H2O)7..Br anion

Gas phase thermochemistry data

Data compiled by: John E. Bartmess

Quantity Value Units Method Reference Comment
Δfgas-2231.0kJ/molTherHiraoka, Mizuse, et al., 1988Entropy estimated
Δfgas-2199.7kJ/molTherMarkovich, Pollack, et al., 1994

References

Hiraoka, Mizuse, et al., 1988
Hiraoka, K.; Mizuse, S.; Yamabe, S., Solvation of Halide Ions with H2O and CH3CN in the Gas Phase, J. Phys. Chem., 1988, 92, 13, 3943, https://doi.org/10.1021/j100324a051 . [all data]

Markovich, Pollack, et al., 1994
Markovich, G.; Pollack, S.; Giniger, R.; Cheshnovsky, O., Photoelectron spectroscopy of Cl-, Br-, and I- solvated in water clusters, J. Chem. Phys., 1994, 101, 11, 9344, https://doi.org/10.1063/1.467965 . [all data]