(H2O)2..Br anion
- Formula: BrH4O2-
- Molecular weight: 115.935

Gas phase thermochemistry data

Data compiled by: John E. Bartmess
Quantity | Value | Units | Method | Reference | Comment |
---|---|---|---|---|---|
ΔfH°gas | -798.01 | kJ/mol | Ther | Hiraoka, Mizuse, et al., 1988 |

Gas phase ion energetics data

Data compiled by: John E. Bartmess
Electron affinity of neutral species
EAneutral (eV) | Method | Reference | Comment |
---|---|---|---|
4.44 ± 0.10 | LPES | Markovich, Pollack, et al., 1994 | For photodissociation plus electron loss. Affinity is difference from lower solvated ion. |

References

Hiraoka, Mizuse, et al., 1988
Hiraoka, K.; Mizuse, S.; Yamabe, S.,
Solvation of Halide Ions with H2O and CH3CN in the Gas Phase,
J. Phys. Chem., 1988, 92, 13, 3943, https://doi.org/10.1021/j100324a051
. [all data]
Markovich, Pollack, et al., 1994
Markovich, G.; Pollack, S.; Giniger, R.; Cheshnovsky, O.,
Photoelectron spectroscopy of Cl-, Br-, and I- solvated in water clusters,
J. Chem. Phys., 1994, 101, 11, 9344, https://doi.org/10.1063/1.467965
. [all data]