YF3..YF4 anion
- Formula: F7Y2-
- Molecular weight: 310.80107

Gas phase thermochemistry data

Data compiled by: John E. Bartmess
Quantity | Value | Units | Method | Reference | Comment |
---|---|---|---|---|---|
ΔfH°gas | -840.5 ± 7.1 | kcal/mol | Ther | Pyatenko, Gusarov, et al., 1981 | ΔHf at 298K, fluoride affinity at 0K; value altered from reference due to conversion from electron convention to ion convention |

Reaction thermochemistry data

Data compiled by: John E. Bartmess
Individual Reactions
By formula: F4Y- + F3Y = F7Y2-
Quantity | Value | Units | Method | Reference | Comment |
---|---|---|---|---|---|
ΔrH° | 56.0 ± 5.0 | kcal/mol | TDAs | Pyatenko, Gusarov, et al., 1981 | gas phase; ΔHf at 298K, fluoride affinity at 0K; value altered from reference due to conversion from electron convention to ion convention |

Ion clustering data

Data compiled by: John E. Bartmess
Clustering reactions
By formula: F4Y- + F3Y = F7Y2-
Quantity | Value | Units | Method | Reference | Comment |
---|---|---|---|---|---|
ΔrH° | 56.0 ± 5.0 | kcal/mol | TDAs | Pyatenko, Gusarov, et al., 1981 | gas phase; ΔHf at 298K, fluoride affinity at 0K; value altered from reference due to conversion from electron convention to ion convention |

References

Pyatenko, Gusarov, et al., 1981
Pyatenko, A.T.; Gusarov, A.V.; Gorokhov, L.N.,
Negative Ions in Vapor over Yttrium Trifluoride,
High Temp., 1981, 19, 1167. [all data]