tin anion
- Formula: Sn-
- Molecular weight: 118.711

Gas phase thermochemistry data

Data compiled by: John E. Bartmess
Quantity | Value | Units | Method | Reference | Comment |
---|---|---|---|---|---|
ΔfH°gas | 193.9 | kJ/mol | R-EA | Vandevraye, Drag, et al., 2013 | Given: 1.112070±0.000002 eV |
ΔfH°gas | 193.8 ± 2.4 | kJ/mol | R-EA | Miller, Miller, et al., 1986 |

Reaction thermochemistry data

Data compiled by: John E. Bartmess
Individual Reactions
Sn- + = HSn
Quantity | Value | Units | Method | Reference | Comment |
---|---|---|---|---|---|
ΔrH° | 1435. ± 13. | kJ/mol | D-EA | Vandevraye, Drag, et al., 2013 | gas phase; Given: 1.112070±0.000002 eV |

Gas phase ion energetics data

Data compiled by: John E. Bartmess
Protonation reactions
Sn- + = HSn
Quantity | Value | Units | Method | Reference | Comment |
---|---|---|---|---|---|
ΔrH° | 1435. ± 13. | kJ/mol | D-EA | Vandevraye, Drag, et al., 2013 | gas phase; Given: 1.112070±0.000002 eV |

References

Vandevraye, Drag, et al., 2013
Vandevraye, M.; Drag, C.; Blondel, C.,
Electron affinity of tin measured by photodetachment microscopy,
J. Phys. B: Atom. Mol. Opt. Phys., 2013, 46, 12, 125002, https://doi.org/10.1088/0953-4075/46/12/125002
. [all data]
Miller, Miller, et al., 1986
Miller, T.M.; Miller, A.E.S.; Lineberger, W.C.,
Electron Affinities of Ge and Sn,
Phys. Rev. A, 1986, 33, 5, 3558, https://doi.org/10.1103/PhysRevA.33.3558
. [all data]