Pyridazine anion
- Formula: C4H4N2-
- Molecular weight: 80.0885

Gas phase thermochemistry data

Data compiled by: John E. Bartmess
Quantity | Value | Units | Method | Reference | Comment |
---|---|---|---|---|---|
ΔfH°gas | 254.1 | kJ/mol | R-EA | Nenner and Schultz, 1975 | Pyridazine. EA estimated as 0.25 eV based on solution phase electrochemical correlations |

References

Nenner and Schultz, 1975
Nenner, I.; Schultz, G.J.,
Temporary negative ions and electron affinities of benzene and N-heterocyclic molecules: Pyridine, pyridazine, pyrimidine, pyrazine, and s-triazine,
J. Chem. Phys., 1975, 62, 1747. [all data]