Nitromethane anion
- Formula: CH3NO2-
- Molecular weight: 61.0406

Ion clustering data

Data compiled by: John E. Bartmess
Clustering reactions
By formula: CH3NO2- + CH3NO2 = (CH3NO2- • CH3NO2)
Quantity | Value | Units | Method | Reference | Comment |
---|---|---|---|---|---|
ΔrH° | 63.60 ± 0.84 | kJ/mol | N/A | Compton, Carman Jr., et al., 1996 | gas phase; Shift in electron detachment from non-solvated ion |
(CH3NO2- • ) +
= (CH3NO2- • 2
)
By formula: (CH3NO2- • CH3NO2) + CH3NO2 = (CH3NO2- • 2CH3NO2)
Quantity | Value | Units | Method | Reference | Comment |
---|---|---|---|---|---|
ΔrH° | 50. ± 150. | kJ/mol | N/A | Compton, Carman Jr., et al., 1996 | gas phase; shift in electron detachment from less solvated ion |
ΔrH° | 53.6 ± 1.3 | kJ/mol | TDAs | Wincel, 2003 | gas phase |
Quantity | Value | Units | Method | Reference | Comment |
ΔrG° | 24.7 | kJ/mol | TDAs | Wincel, 2003 | gas phase |

Reaction thermochemistry data

Data compiled by: John E. Bartmess
Individual Reactions
(CH3NO2- • ) +
= (CH3NO2- • 2
)
By formula: (CH3NO2- • CH3NO2) + CH3NO2 = (CH3NO2- • 2CH3NO2)
Quantity | Value | Units | Method | Reference | Comment |
---|---|---|---|---|---|
ΔrH° | 13. ± 35. | kcal/mol | N/A | Compton, Carman Jr., et al., 1996 | gas phase; shift in electron detachment from less solvated ion |
ΔrH° | 12.80 ± 0.30 | kcal/mol | TDAs | Wincel, 2003 | gas phase |
Quantity | Value | Units | Method | Reference | Comment |
ΔrG° | 5.90 | kcal/mol | TDAs | Wincel, 2003 | gas phase |
By formula: CH3NO2- + CH3NO2 = (CH3NO2- • CH3NO2)
Quantity | Value | Units | Method | Reference | Comment |
---|---|---|---|---|---|
ΔrH° | 15.20 ± 0.20 | kcal/mol | N/A | Compton, Carman Jr., et al., 1996 | gas phase; Shift in electron detachment from non-solvated ion |

Gas phase thermochemistry data

Data compiled by: John E. Bartmess

Quantity Value Units Method Reference Comment
Δfgas-90.92 ± 0.75kJ/molR-EAAdams, Schneider, et al., 2009

References

Compton, Carman Jr., et al., 1996
Compton, R.N.; Carman Jr.; Desfrancois, C.; Abdoul-Carmine, H.; Schermann, J.P.; Hendricks, J.H.,
On the binding of Electrons to Nitromethane: Dipole and Valence Bound Anions,
J. Chem. Phys., 1996, 105, 9, 3472, https://doi.org/10.1063/1.472993
. [all data]
Wincel, 2003
Wincel, H.,
Gas-phase Solvation of Cl-, NO2-, CH2NO2-, CH3NO2-, and CH3NO4- by CH3NO2,
Int. J. Mass Spectrom., 2003, 226, 3, 341-353, https://doi.org/10.1016/S1387-3806(03)00066-6
. [all data]