(CO2)7..CO3 radical anion
- Formula: C8O17-
- Molecular weight: 368.0759

Gas phase thermochemistry data

Data compiled by: John E. Bartmess
Quantity | Value | Units | Method | Reference | Comment |
---|---|---|---|---|---|
ΔfH°gas | -815.09 | kcal/mol | Ther | Hiraoka and Yamabe, 1992 | Estimated entropy; single temperature measurement |

Ion clustering data

Data compiled by: John E. Bartmess
Clustering reactions
C7O15- + 7 = C8O17-
By formula: C7O15- + 7CO2 = C8O17-
Quantity | Value | Units | Method | Reference | Comment |
---|---|---|---|---|---|
ΔrH° | 4.5 ± 1.0 | kcal/mol | TDAs | Hiraoka and Yamabe, 1992 | gas phase; Estimated entropy; single temperature measurement |
Quantity | Value | Units | Method | Reference | Comment |
ΔrG° | -2.1 ± 1.0 | kcal/mol | TDAs | Hiraoka and Yamabe, 1992 | gas phase; Estimated entropy; single temperature measurement |

References

Hiraoka and Yamabe, 1992
Hiraoka, K.; Yamabe, S.,
Formation of the Chelate Bonds in the Cluster O2(-)(CO2)n, CO3(-)(CO2)n, and NO2(-)(CO2)n,
J. Chem. Phys., 1992, 97, 1, 643, https://doi.org/10.1063/1.463560
. [all data]