(CO2)6..CO3 radical anion
- Formula: C7O15-
- Molecular weight: 324.0664

Gas phase thermochemistry data

Data compiled by: John E. Bartmess
Quantity | Value | Units | Method | Reference | Comment |
---|---|---|---|---|---|
ΔfH°gas | -716.55 | kcal/mol | Ther | Hiraoka and Yamabe, 1992 |

Ion clustering data

Data compiled by: John E. Bartmess
Clustering reactions
C6O13- + 6 = C7O15-
By formula: C6O13- + 6CO2 = C7O15-
Quantity | Value | Units | Method | Reference | Comment |
---|---|---|---|---|---|
ΔrH° | 4.7 ± 1.0 | kcal/mol | TDAs | Hiraoka and Yamabe, 1992 | gas phase |
Quantity | Value | Units | Method | Reference | Comment |
ΔrG° | -1.9 ± 1.0 | kcal/mol | TDAs | Hiraoka and Yamabe, 1992 | gas phase |
C7O15- + 7 = C8O17-
By formula: C7O15- + 7CO2 = C8O17-
Quantity | Value | Units | Method | Reference | Comment |
---|---|---|---|---|---|
ΔrH° | 4.5 ± 1.0 | kcal/mol | TDAs | Hiraoka and Yamabe, 1992 | gas phase; Estimated entropy; single temperature measurement |
Quantity | Value | Units | Method | Reference | Comment |
ΔrG° | -2.1 ± 1.0 | kcal/mol | TDAs | Hiraoka and Yamabe, 1992 | gas phase; Estimated entropy; single temperature measurement |

Reaction thermochemistry data

Data compiled by: John E. Bartmess

Individual Reactions

C7O15- + 7Carbon dioxide = C8O17-

By formula: C7O15- + 7CO2 = C8O17-

Quantity Value Units Method Reference Comment
Δr19. ± 4.2kJ/molTDAsHiraoka and Yamabe, 1992gas phase; Estimated entropy; single temperature measurement
Quantity Value Units Method Reference Comment
Δr-8.8 ± 4.2kJ/molTDAsHiraoka and Yamabe, 1992gas phase; Estimated entropy; single temperature measurement

C6O13- + 6Carbon dioxide = C7O15-

By formula: C6O13- + 6CO2 = C7O15-

Quantity Value Units Method Reference Comment
Δr20. ± 4.2kJ/molTDAsHiraoka and Yamabe, 1992gas phase
Quantity Value Units Method Reference Comment
Δr-7.9 ± 4.2kJ/molTDAsHiraoka and Yamabe, 1992gas phase

References

Hiraoka and Yamabe, 1992
Hiraoka, K.; Yamabe, S.,
Formation of the Chelate Bonds in the Cluster O2(-)(CO2)n, CO3(-)(CO2)n, and NO2(-)(CO2)n,
J. Chem. Phys., 1992, 97, 1, 643, https://doi.org/10.1063/1.463560
. [all data]