(CO2)3..CO3 radical anion
- Formula: C4O9-
- Molecular weight: 192.0379

Gas phase thermochemistry data

Data compiled by: John E. Bartmess
Quantity | Value | Units | Method | Reference | Comment |
---|---|---|---|---|---|
ΔfH°gas | -419.73 | kcal/mol | Ther | Hiraoka and Yamabe, 1992 |

Ion clustering data

Data compiled by: John E. Bartmess
Clustering reactions
C3O7- + 3 = C4O9-
By formula: C3O7- + 3CO2 = C4O9-
Quantity | Value | Units | Method | Reference | Comment |
---|---|---|---|---|---|
ΔrH° | 5.5 ± 1.0 | kcal/mol | TDAs | Hiraoka and Yamabe, 1992 | gas phase |
Quantity | Value | Units | Method | Reference | Comment |
ΔrG° | -1.1 ± 1.0 | kcal/mol | TDAs | Hiraoka and Yamabe, 1992 | gas phase |
C4O9- + 4 = C5O11-
By formula: C4O9- + 4CO2 = C5O11-
Quantity | Value | Units | Method | Reference | Comment |
---|---|---|---|---|---|
ΔrH° | 5.2 ± 1.0 | kcal/mol | TDAs | Hiraoka and Yamabe, 1992 | gas phase |
Quantity | Value | Units | Method | Reference | Comment |
ΔrG° | -1.5 ± 1.0 | kcal/mol | TDAs | Hiraoka and Yamabe, 1992 | gas phase |

References

Hiraoka and Yamabe, 1992
Hiraoka, K.; Yamabe, S.,
Formation of the Chelate Bonds in the Cluster O2(-)(CO2)n, CO3(-)(CO2)n, and NO2(-)(CO2)n,
J. Chem. Phys., 1992, 97, 1, 643, https://doi.org/10.1063/1.463560
. [all data]