(MeO)3PO..UO2(CF3COCHCOCF3)2 radical anion

Gas phase ion energetics data

Data compiled by: John E. Bartmess

Electron affinity of neutral species

EAneutral (eV) Method Reference Comment
1.50 ± 0.30NBIEYokozeki, Quitevis, et al., 1982

References

Yokozeki, Quitevis, et al., 1982
Yokozeki, A.; Quitevis, E.L.; Herschbach, D.R., Electron attachment to volatile uranyl molecules, J. Phys. Chem., 1982, 86, 617. [all data]