(MeO)2BO anion
- Formula: C2H6BO3-
- Molecular weight: 88.879

Gas phase ion energetics data

Data compiled by: John E. Bartmess
Protonation reactions
C2H6BO3- + = C2H7BO3
By formula: C2H6BO3- + H+ = C2H7BO3
Quantity | Value | Units | Method | Reference | Comment |
---|---|---|---|---|---|
ΔrH° | 360.2 ± 4.6 | kcal/mol | G+TS | Kiplinger, Crowder, et al., 1994 | gas phase; between tBuCH=NOH, pyrrole. Stein, Rikkers, et al. is wrong on GpAd for (MeO)2BOH |
Quantity | Value | Units | Method | Reference | Comment |
ΔrG° | 353.4 ± 4.5 | kcal/mol | IMRB | Kiplinger, Crowder, et al., 1994 | gas phase; between tBuCH=NOH, pyrrole. Stein, Rikkers, et al. is wrong on GpAd for (MeO)2BOH |

References

Kiplinger, Crowder, et al., 1994
Kiplinger, J.P.; Crowder, C.A.; Sorensen, D.N.; Bartmess, J.E.,
Gas-Phase Ion-Molecule Chemistry of Borate and Boronate Esters,
J. Am. Soc. Mass Spectrom., 1994, 5, 3, 169, https://doi.org/10.1016/1044-0305(94)85030-5
. [all data]
Stein, Rikkers, et al.
Stein, S.E.; Rikkers, J.M.; Brown, R.L.,
NIST Structure anmd Properties Database and Estimation Program, Ver. 1.1, NIST Standard Reference Database 25. [all data]