indium anion
- Formula: In-
- Molecular weight: 114.819

Gas phase thermochemistry data

Data compiled by: John E. Bartmess
Quantity | Value | Units | Method | Reference | Comment |
---|---|---|---|---|---|
ΔfH°gas | 204. ± 9.2 | kJ/mol | Acid | Walter, Gibson, et al., 2010 | Given: 383.92±0.06 meV |

Reaction thermochemistry data

Data compiled by: John E. Bartmess
Individual Reactions
In- + = HIn
Quantity | Value | Units | Method | Reference | Comment |
---|---|---|---|---|---|
ΔrH° | 1519. ± 8.8 | kJ/mol | D-EA | Walter, Gibson, et al., 2010 | gas phase; Given: 383.92±0.06 meV |
Quantity | Value | Units | Method | Reference | Comment |
ΔrG° | 1498. ± 9.2 | kJ/mol | H-TS | Walter, Gibson, et al., 2010 | gas phase; Given: 383.92±0.06 meV |

Gas phase ion energetics data

Data compiled by: John E. Bartmess
Protonation reactions
In- + = HIn
Quantity | Value | Units | Method | Reference | Comment |
---|---|---|---|---|---|
ΔrH° | 363.0 ± 2.1 | kcal/mol | D-EA | Walter, Gibson, et al., 2010 | gas phase; Given: 383.92±0.06 meV |
Quantity | Value | Units | Method | Reference | Comment |
ΔrG° | 358.0 ± 2.2 | kcal/mol | H-TS | Walter, Gibson, et al., 2010 | gas phase; Given: 383.92±0.06 meV |

References

Walter, Gibson, et al., 2010
Walter, C.W.; Gibson, N.D.; Carman, D.J.; Li, Y.G.; Matyas, D.J.,
Electron affinity of indium and the fine structure of In- measured using infrared photodetachment threshold spectroscopy,
Phys. Rev. A, 2010, 82, 3, 032507, https://doi.org/10.1103/PhysRevA.82.032507
. [all data]